{"text_format":"1","workbook":"xlsx","n_sheets":7,"sheets":["Catalogos","Catalogo 2","Catalogo_3","Catalogo_4","Catalogo_LP","Inicio","Layout"],"not_rendered":{"charts":0,"images":3,"macros":1,"external_links":0,"defined_names":4,"comments":0,"pivot_tables":0},"unopened":[],"bounds":{"document_bytes":16777216,"sheet_cells":100000,"rows_first":2000,"rows_last":500,"rows_between":2000,"halvings":0,"cell_chars":16384,"cell_head_chars":4096},"cells_cut":0,"cells_raw":0,"read":"whole","date_system":"1900"}

{"sheet":"Catalogos","index":0,"n_rows":41,"n_cols":3,"rows_kept":41,"cut":false,"hidden":true,"merged":[]}
["Especificación","Método de Prueba","Unidad de Medida"]
["Grasa buritrica","NMX-F-744-COFOCALEC-2011","% (m/m)"]
["Grasa buritrica","ISO 1736: 2008","% (m/m)"]
["Grasa buritrica","AOAC Method 989.05","% (m/m)"]
["Grasa buritrica","AOAC Method 932.06","% (m/m)"]
[]
[]
["Húmedad","NOM - 243 - SSAA - 2010","% (m/m)"]
["Húmedad","ISO 5537:2004","% (m/m)"]
["Húmedad","AOAC Method 927.05","% (m/m)"]
[]
[]
["Húmedad (con base a sólidos no grasos)","NOM - 243 - SSAA - 2010","% (m/m)"]
["Húmedad (con base a sólidos no grasos)","ISO 5537:2004","% (m/m)"]
["Húmedad (con base a sólidos no grasos)","AOAC Method 927.05","% (m/m)"]
[]
[]
["Proteína Total con base a sólidos lácteos no grasos","NOM - 155 - SCFI - 2012","% (m/m)"]
["Proteína Total con base a sólidos lácteos no grasos","ISO 8968 - 1: 2014","% (m/m)"]
["Proteína Total con base a sólidos lácteos no grasos","AOAC Method 991.20","% (m/m)"]
["Proteína Total con base a sólidos lácteos no grasos","AOAC Method 930.29","% (m/m)"]
[]
[]
["Caseína expresada en sólidos lácteos no grasos","NOM - 155 - SCFI - 2012","% (m/m)"]
[]
["Acidez como ácido láctico %","NMX - F - 725/1 - COFOCALEC - 2016","%"]
["Acidez como ácido láctico %","ISO 6091: 2010","%"]
["Acidez como ácido láctico %","ADPI","%"]
[]
[]
[]
["Partículas quemadas","NMX - F - 204 - 1986","mg"]
["Partículas quemadas","ADPI","mg"]
[]
[]
["índice de insolubilidad","NMX-F-744-COFOCALEC-2011","ml"]
["índice de insolubilidad","ISO 8156:2005","ml"]
["índice de insolubilidad","ADPI","ml"]
[]
[]
["Lactosa residual para ser considerada deslactosada ","NOM - 155 - SCFI - 2012","g/L"]

{"sheet":"Catalogo 2","index":1,"n_rows":82,"n_cols":9,"rows_kept":82,"cut":false,"hidden":true,"merged":[]}
["Tipo de Leche",null,"Producto",null,"Deslactosada",null,null,"Fracción"]
["Extra",null,"Leche Entera",null,"Si",null,"Leche Descremada","0402.10.01","04021001"]
["Estandar",null,"Leche Parcialmente Descremada",null,"No",null,"Leche Entera","0402.21.01","04022101"]
[null,null,"Leche Descremada",null,null,null,"Leche Parcialmente Descremada","0402.21.01","04022101"]
[]
["Humedad % (m/m)"]
["Humedad con base a sólidos no grasos % (m/m)"]
[]
[]
["Laboratorios",null,"CONTRASEÑA"]
["Agri-Mark","L00161","Agr61"]
["AGROLAB LUFA GmbH","L00220","AGR20"]
["Agropur Jerome Laboratory","L00225","Agr25"]
["Alliance Analytical Labs","L00165","All65"]
["ALS Global","L00190","ALS90"]
["Associated Milk Producer Inc","L00279","Ass79"]
["AsureQuality Limited","L00208","Asu08"]
["BUREAU VERITAS CANADA (2019) INC.","L00244","BUR44"]
["Cayuga Milk Ingredients","L00182","Cay82"]
["Certified Laboratories of Northern California","L00145","Cer45"]
["Cherney Microbiological Services LTD.","L00272","Che72"]
["Conagra Brands","L07COV","ConOV"]
["Dairy Farmers of America, Inc. Colorado","L00219","Dai19"]
["Dairy Farmers of America, Inc. Nevada","L00202","Dai02"]
["Dairy Farmers of America, Inc. New México","L00063","Dai63"]
["Dairy Farmers of America, Inc. Texas","L00241","Dai41"]
["DARIGOLD CALDWELL","L00144","DAR44"]
["DARIGOLD CHEHALIS","L00142","DAR42"]
["DARIGOLD CORPORATE LAB (DCL)","L00108","DAR08"]
["DARIGOLD JEROME","L00143","DAR43"]
["DARIGOLD LYNDEN ","L00141","DAR41"]
["DARIGOLD SUNNYSIDE","L00107","DAR07"]
["Deibel Laboratories","L06COV","DeiOV"]
["Deseret Dairy Products","L00245","Des45"]
["ESIANLAB SC","L00028","ESI28"]
["Eurofins DQCI, LLC","L00183","Eur83"]
["Eurofins ELS Limited","L00211","Eur11"]
["Eurofins Food Analytics NZ Limited","L00207","Eur07"]
["Fonterra Ltd Clandeboye Laboratory","L00186","Fon86"]
["Fonterra Ltd. Te Rapa Laboratory ","L00189","Fon89"]
["Fonterra Ltd. Waitoa Laboratory","L00187","Fon87"]
["Fonterra Ltd. Whareroa Laboratory ","L00188","Fon88"]
["Foremost Farms USA","L00228","For28"]
["Goodman Fielder New Zealand Limited","L00205","Goo05"]
["Heinz Wattie's Limited","L00204","Hei04"]
["High Desert Milk Lab","L00082","Hig82"]
["Idaho Milk Products","L00216","Ida16"]
["Laboratorio Central de Analisis de Granby","L00191","Lab91"]
["LABORATORIO CONAPROLE","L00226","LAB26"]
["LABORATORIO TECNOLOGICO DEL URUGUAY","L00217","LAB17"]
["Land O'Lakes, Inc. Carlisle","L00061","Lan61"]
["Le Sueur Food Ingredient Laboratory","L00224","Le 24"]
["Lone Star Dairy Products","L00041","Lon41"]
["Lufa Nord - West","L00214","Luf14"]
["Maryland & Virginia Milk Producers Cooperative Association","L00185","Mar85"]
["Matrix Sciences International Inc.","L00201","Mat01"]
["Meadowlark Dairy Nutrition LLC","L00203","Mea03"]
["Merieux Nutrisciences","L00164","Mer64"]
["Midwest Laboratories, Inc.","L00267","Mid67"]
["MilkTest NZ LP","L00209","Mil09"]
{"$rows_left_out":23}
{"sheet":"Catalogo_3","index":2,"n_rows":96,"n_cols":10,"rows_kept":96,"cut":false,"hidden":true,"merged":[]}
["Producto","Especificación","Método de Prueba",null,"ID Metodo de Prueba","Unidad de Medida","Mínimo","Máximo"]
["Leche Entera","Grasa buritrica","NMX-F-744-COFOCALEC-2011",{"$f":"CONCATENATE(A2,\"_\",C2)","v":"Leche Entera_NMX-F-744-COFOCALEC-2011"},"GB-1","% (m/m)",">= a 26","<= a 42"]
["Leche Entera","Grasa buritrica","ISO 1736: 2008",{"$f":"CONCATENATE(A3,\"_\",C3)","v":"Leche Entera_ISO 1736: 2008"},"GB-2","% (m/m)",">= a 26","<= a 42"]
["Leche Entera","Grasa buritrica","AOAC Method 989.05","Leche Entera_AOAC Method 989.05","GB-3","% (m/m)",">= a 26","<= a 42"]
["Leche Entera","Grasa buritrica","AOAC Method 932.06","Leche Entera_AOAC Method 932.06","GB-4","% (m/m)",">= a 26","<= a 42"]
["Leche Parcialmente Descremada","Grasa buritrica","NMX-F-744-COFOCALEC-2011","Leche Parcialmente Descremada_NMX-F-744-COFOCALEC-2011","GB-5","% (m/m)","> a 1.5","< a 26"]
["Leche Parcialmente Descremada","Grasa buritrica","ISO 1736: 2008",{"$f":"CONCATENATE(A7,\"_\",C7)","v":"Leche Parcialmente Descremada_ISO 1736: 2008"},"GB-6","% (m/m)","> a 1.5","< a 26"]
["Leche Parcialmente Descremada","Grasa buritrica","AOAC Method 989.05","Leche Parcialmente Descremada_AOAC Method 989.05","GB-7","% (m/m)","> a 1.5","< a 26"]
["Leche Parcialmente Descremada","Grasa buritrica","AOAC Method 932.06","Leche Parcialmente Descremada_AOAC Method 932.06","GB-8","% (m/m)","> a 1.5","< a 26"]
["Leche descremada","Grasa buritrica","NMX-F-744-COFOCALEC-2011","Leche descremada_NMX-F-744-COFOCALEC-2011","GB-9","% (m/m)","< a 1.5",1.5]
["Leche descremada","Grasa buritrica","ISO 1736: 2008","Leche descremada_ISO 1736: 2008","GB-10","% (m/m)","< a 1.5",1.5]
["Leche descremada","Grasa buritrica","AOAC Method 989.05","Leche descremada_AOAC Method 989.05","GB-11","% (m/m)","< a 1.5",1.5]
["Leche descremada","Grasa buritrica","AOAC Method 932.06","Leche descremada_AOAC Method 932.06","GB-12","% (m/m)","< a 1.5",1.5]
[]
[]
["Leche Entera","Húmedad","NOM - 243 - SSAA - 2010",null,"HU-1","% (m/m)",4,4]
["Leche Parcialmente Descremada","Húmedad","ISO 5537:2004",null,"HU-2","% (m/m)",4,4]
["Leche descremada","Húmedad","AOAC Method 927.05",null,"HU-3","% (m/m)",4,4]
[]
[]
["Leche Entera","Húmedad (con base a sólidos no grasos)",null,"NOM - 243 - SSAA - 2010","HNG-1","% (m/m)",5,5]
["Leche Parcialmente Descremada","Húmedad (con base a sólidos no grasos)",null,"ISO 5537:2004","HNG-2","% (m/m)",5,5]
["Leche descremada","Húmedad (con base a sólidos no grasos)",null,"AOAC Method 927.05","HNG-3","% (m/m)",5,5]
[]
["Leche Entera","Proteína Total con base a sólidos lácteos no grasos",null,"NOM - 155 - SCFI - 2012","PNG-1","% (m/m)",34,">34"]
["Leche Parcialmente Descremada","Proteína Total con base a sólidos lácteos no grasos",null,"ISO 8968 - 1: 2014","PNG-2","% (m/m)",34,">34"]
["Leche descremada","Proteína Total con base a sólidos lácteos no grasos",null,"AOAC Method 991.20","PNG-3","% (m/m)",34,">34"]
[null,"Proteína Total con base a sólidos lácteos no grasos",null,"AOAC Method 930.29","PNG-4","% (m/m)",34,">34"]
[]
[]
["Leche Entera","Caseína expresada en sólidos lácteos no grasos",null,"NOM - 155 - SCFI - 2012","CNG-1","% (m/m)",27,">27"]
["Leche Parcialmente Descremada"]
["Leche descremada"]
[]
[]
["Leche Entera","Acidez como ácido láctico %","Extra","NMX - F - 725/1 - COFOCALEC - 2016","NMX - F - 725/1 - COFOCALEC - 2016",{"$f":"A36&C36&D36","v":"Leche EnteraExtraNMX - F - 725/1 - COFOCALEC - 2016"},"AA-1","%","<0.15",0.15]
["Leche Entera","Acidez como ácido láctico %","Estandar","NMX - F - 725/1 - COFOCALEC - 2016","ISO 6091: 2010",{"$f":"A37&C37&D37","v":"Leche EnteraEstandarNMX - F - 725/1 - COFOCALEC - 2016"},"AA-2","%","<0.17",0.17]
["Leche Entera","Acidez como ácido láctico %","Extra","ISO 6091: 2010","ADPI","Leche EnteraExtraISO 6091: 2010","AA-3","%","<0.15",0.15]
["Leche Entera","Acidez como ácido láctico %","Estandar","ISO 6091: 2010",null,"Leche EnteraEstandarISO 6091: 2010","AA-4","%","<0.17",0.17]
["Leche Entera","Acidez como ácido láctico %","Extra","ADPI",null,"Leche EnteraExtraADPI","AA-5","%","<0.15",0.15]
["Leche Entera","Acidez como ácido láctico %","Estandar","ADPI",null,"Leche EnteraEstandarADPI","AA-6","%","<0.17",0.17]
["Leche Parcialmente Descremada","Acidez como ácido láctico %","Extra","NMX - F - 725/1 - COFOCALEC - 2016",null,"Leche Parcialmente DescremadaExtraNMX - F - 725/1 - COFOCALEC - 2016","AA-7","%","<0.15",0.15]
["Leche Parcialmente Descremada","Acidez como ácido láctico %","Estandar","NMX - F - 725/1 - COFOCALEC - 2016",null,"Leche Parcialmente DescremadaEstandarNMX - F - 725/1 - COFOCALEC - 2016","AA-8","%","<0.17",0.17]
["Leche Parcialmente Descremada","Acidez como ácido láctico %","Extra","ISO 6091: 2010",null,"Leche Parcialmente DescremadaExtraISO 6091: 2010","AA-9","%","<0.15",0.15]
["Leche Parcialmente Descremada","Acidez como ácido láctico %","Estandar","ISO 6091: 2010",null,"Leche Parcialmente DescremadaEstandarISO 6091: 2010","AA-10","%","<0.17",0.17]
["Leche Parcialmente Descremada","Acidez como ácido láctico %","Extra","ADPI",null,"Leche Parcialmente DescremadaExtraADPI","AA-11","%","<0.15",0.15]
["Leche Parcialmente Descremada","Acidez como ácido láctico %","Estandar","ADPI",null,"Leche Parcialmente DescremadaEstandarADPI","AA-12","%","<0.17",0.17]
["Leche descremada","Acidez como ácido láctico %","Extra","NMX - F - 725/1 - COFOCALEC - 2016",null,"Leche descremadaExtraNMX - F - 725/1 - COFOCALEC - 2016","AA-13","%","<0.15",0.15]
["Leche descremada","Acidez como ácido láctico %","Estandar","NMX - F - 725/1 - COFOCALEC - 2016",null,"Leche descremadaEstandarNMX - F - 725/1 - COFOCALEC - 2016","AA-14","%","<0.17",0.17]
["Leche descremada","Acidez como ácido láctico %","Extra","ISO 6091: 2010",null,"Leche descremadaExtraISO 6091: 2010","AA-15","%","<0.15",0.15]
["Leche descremada","Acidez como ácido láctico %","Estandar","ISO 6091: 2010",null,"Leche descremadaEstandarISO 6091: 2010","AA-16","%","<0.17",0.17]
["Leche descremada","Acidez como ácido láctico %","Extra","ADPI",null,"Leche descremadaExtraADPI","AA-17","%","<0.15",0.15]
["Leche descremada","Acidez como ácido láctico %","Estandar","ADPI",null,"Leche descremadaEstandarADPI","AA-18","%","<0.17",0.17]
[]
[]
["Leche Entera","Partículas quemadas","Extra","NMX - F - 204 - 1986 / Disco B / Entera","NMX - F - 204 - 1986",{"$f":"A56&C56&E56","v":"Leche EnteraExtraNMX - F - 204 - 1986"},"PQ-1","mg","Disco B / <15","Disco B / 15"]
["Leche Entera","Partículas quemadas","Estandar","NMX - F - 204 - 1986 / Disco C / Entera","NMX - F - 204 - 1986",{"$f":"A57&C57&E57","v":"Leche EnteraEstandarNMX - F - 204 - 1986"},"PQ-2","mg","Disco C / <22.5","Disco C / 22.5"]
["Leche Entera","Partículas quemadas","Extra","ADPI / Disco B / Entera","ADPI","Leche EnteraExtraADPI","PQ-3","mg","Disco B / <15","Disco B / 15"]
["Leche Entera","Partículas quemadas","Estandar","ADPI / Disco C / Entera","ADPI","Leche EnteraEstandarADPI","PQ-4","mg","Disco C / <22.5","Disco C / 22.5"]
["Leche Parcialmente Descremada","Partículas quemadas","Extra","NMX - F - 204 - 1986 / Disco B / Parcialmente Descremada","NMX - F - 204 - 1986","Leche Parcialmente DescremadaExtraNMX - F - 204 - 1986","PQ-5","mg","Disco B / <15","Disco B / 15"]
{"$rows_left_out":37}
{"sheet":"Catalogo_4","index":3,"n_rows":258,"n_cols":2,"rows_kept":258,"cut":false,"hidden":true,"merged":[]}
["PAIS","PAIS DESC. CORTA"]
["ESTADOS UNIDOS DE AMERICA","ESTADOS UNIDOS DE AMERICA"]
["AFGANISTAN (EMIRATO ISLAMICO DE)","AFGANISTAN"]
["ALBANIA (REPUBLICA DE)","ALBANIA"]
["ALEMANIA (REPUBLICA FEDERAL DE)","ALEMANIA"]
["ANDORRA (PRINCIPADO DE)","ANDORRA"]
["ANGOLA (REPUBLICA DE)","ANGOLA"]
["ANGUILA","ANGUILA"]
["ANTARTIDA","ANTARTIDA"]
["ANTIGUA Y BARBUDA (COMUNIDAD BRITANICA DE NACIONES)","ANTIGUA Y BARBUDA"]
["ANTILLAS NEERLANDESAS (TERRITORIO HOLANDES DE ULTRAMAR)","ANTILLAS NEERLANDESAS"]
["ARABIA SAUDITA (REINO DE)","ARABIA SAUDITA"]
["ARGELIA (REPUBLICA DEMOCRATICA Y POPULAR DE)","ARGELIA"]
["ARGENTINA (REPUBLICA)","ARGENTINA"]
["ARMENIA (REPUBLICA DE)","ARMENIA"]
["ARUBA (TERRITORIO HOLANDES DE ULTRAMAR)","ARUBA"]
["AUSTRALIA (COMUNIDAD DE)","AUSTRALIA"]
["AUSTRIA (REPUBLICA DE)","AUSTRIA"]
["AZERBAIJAN (REPUBLICA AZERBAIJANI)","AZERBAIJAN"]
["BAHAMAS (COMUNIDAD DE LAS)","BAHAMAS"]
["BAHREIN (ESTADO DE)","BAHREIN"]
["BANGLADESH (REPUBLICA POPULAR DE)","BANGLADESH"]
["BARBADOS (COMUNIDAD BRITANICA DE NACIONES)","BARBADOS"]
["BELGICA (REINO DE)","BELGICA"]
["BELICE","BELICE"]
["BENIN (REPUBLICA DE)","BENIN"]
["BERMUDAS","BERMUDAS"]
["BIELORRUSIA (REPUBLICA DE)","BIELORRUSIA"]
["BOLIVIA (REPUBLICA DE)","BOLIVIA"]
["BONAIRE, SAN EUSTAQUIO Y SABA","BONAIRE, SAN EUSTAQUIO Y SABA"]
["BOSNIA Y HERZEGOVINA","BOSNIA Y HERZEGOVINA"]
["BOTSWANA (REPUBLICA DE)","BOTSWANA"]
["BRASIL (REPUBLICA FEDERATIVA DE)","BRASIL"]
["BRUNEI (ESTADO DE) (RESIDENCIA DE PAZ)","BRUNEI"]
["BULGARIA (REPUBLICA DE)","BULGARIA"]
["BURKINA FASO","BURKINA FASO"]
["BURUNDI (REPUBLICA DE)","BURUNDI"]
["BUTAN (REINO DE)","BUTAN"]
["CABO VERDE (REPUBLICA DE)","CABO VERDE"]
["CAIMAN (ISLAS)","CAIMAN"]
["CAMBOYA (REINO DE)","CAMBOYA"]
["CAMERUN (REPUBLICA DEL)","CAMERUN"]
["CANADA","CANADA"]
["CANAL, ISLAS DEL (ISLAS NORMANDAS)","CANAL, ISLAS DEL"]
["CHAD (REPUBLICA DEL)","CHAD"]
["CHILE (REPUBLICA DE)","CHILE"]
["CHINA (REPUBLICA POPULAR)","CHINA"]
["CHIPRE (REPUBLICA DE)","CHIPRE"]
["CIUDAD DEL VATICANO (ESTADO DE LA)","CIUDAD DEL VATICANO"]
["COCOS (KEELING, ISLAS AUSTRALIANAS)","COCOS"]
["COLOMBIA (REPUBLICA DE)","COLOMBIA"]
["COMORAS (ISLAS)","COMORAS"]
["COMUNIDAD EUROPEA","COMUNIDAD EUROPEA"]
["CONGO (REPUBLICA DEL)","CONGO"]
["COOK (ISLAS)","COOK"]
["COREA (REPUBLICA POPULAR DEMOCRATICA DE) (COREA DEL NORTE)","COREA DEL NORTE"]
["COREA (REPUBLICA DE) (COREA DEL SUR)","COREA DEL SUR"]
["COSTA DE MARFIL (REPUBLICA DE LA)","COSTA DE MARFIL"]
["COSTA RICA (REPUBLICA DE)","COSTA RICA"]
["CROACIA (REPUBLICA DE)","CROACIA"]
{"$rows_left_out":199}
{"sheet":"Catalogo_LP","index":4,"n_rows":143,"n_cols":14,"rows_kept":143,"cut":false,"hidden":true,"merged":[]}
["Laboratorio","Fecha_Registro","Folio","País","Domicilio","Ciudad","CP","Opciones","Fracción",null,null,"Fracciones Arancelarias"]
["Agri-Mark","2019-12-26",161,"USA","958 Riverdale Street","West Springfield",1089,2,1,null,null,1,"04021001","Leche en polvo o en pastillas con un contenido de materias grasas inferior o igual a 1.5% en peso - Descremada;"]
["AGROLAB LUFA GmbH","2020-02-05",220,"DEU","Dr.-Hell-Str. 6","Kiel",24107,"3,4",1,null,null,2,"04022101","Leche en polvo o en pastillas sin adición de azúcares u otro edulcorante – Entera y Parcialmente Descremada;"]
["AGROLAB LUFA GmbH","2020-02-05",220,"DEU","Dr.-Hell-Str. 6","Kiel",24107,"3,4",2,null,null,3,"4022999","Los demás"]
["AGROLAB LUFA GmbH","2020-02-05",220,"DEU","Dr.-Hell-Str. 6","Kiel",24107,"3,4",3]
["Agropur Jerome Laboratory","2020-02-10",225,"USA","547 W Nez Perce","Jerome",83338,3,1]
["Alliance Analytical Labs","2019-12-26",165,"USA","179 West Randall Street","Coopersville",49404,4,1]
["ALS Global","2020-01-16",190,"USA","510 St. Joseph Ave","Marshfield",54449,4,1]
["ALS Global","2020-01-16",190,"USA","510 St. Joseph Ave","Marshfield",54449,4,2,null,null,"Opciones"]
["ALS Global","2020-01-16",190,"USA","510 St. Joseph Ave","Marshfield",54449,4,3,null,null,1,"Acreditado y aprobado conforme a la Ley Federal sobre Metrología y Normalización. / Accredited and approved according to the Federal Law on Metrology and Standardization (Mexican legislation);"]
["Associated Milk Producer Inc","2020-03-24",279,"USA","3281 40th Street","Arlington",50606,"2,4",1,null,null,2,"Sus informes son reconocidos para la obtención de un permiso sanitario previo de importación, autorizados por la Comisión Federal para la Protección contra Riesgos Sanitarios o cualquier otra autoridad del gobierno mexicano. / Its reports are recognized by COFEPRIS (by its initials in Spanish) to get a previous sanitary permit for importation or by any Mexican authority.;"]
["Associated Milk Producer Inc","2020-03-24",279,"USA","3281 40th Street","Arlington",50606,"2,4",2,null,null,3,"Es reconocido por autoridades competentes o entidades de acreditación en el extranjero, O; / Is recognized by foreign authorities or foreign accreditation entities;"]
["Associated Milk Producer Inc","2020-03-24",279,"USA","3281 40th Street","Arlington",50606,"2,4",3,null,null,4,"Cumple con la Norma NMX-EC-17025-IMNC-2018 o ISO/IEC 17025:2017. / Complies with the standard NMX-EC-17025-IMNC-2018 or ISO/IEC 17025:2017."]
["AsureQuality Limited","2020-01-23",208,"NZL","131 Boundary Road, Blockhouse Bay , Lynfield, AUCKLAND","Auckland",1140,3,1]
["AsureQuality Limited","2020-01-23",208,"NZL","131 Boundary Road, Blockhouse Bay , Lynfield, AUCKLAND","Auckland",1140,3,2]
["AsureQuality Limited","2020-01-23",208,"NZL","131 Boundary Road, Blockhouse Bay , Lynfield, AUCKLAND","Auckland",1140,3,3]
["BUREAU VERITAS CANADA (2019) INC.","2020-02-20",244,"CAN","6740 CAMPOBELLO ROAD","MISSISSAUGA",528,4,1]
["Cayuga Milk Ingredients","2020-01-10",182,"USA","15 Eagle Drive","Auburn",13021,3,1]
["Cayuga Milk Ingredients","2020-01-10",182,"USA","15 Eagle Drive","Auburn",13021,3,2]
["Certified Laboratories of Northern California","2019-12-19",145,"USA","3241 Liberty Square Parkway","Turlock",95380,"3,4",3]
["Cherney Microbiological Services LTD.","2020-03-19",272,"USA","1110 S. Huron Road","Green Bay",54311,"1,2,3,4",1]
["Cherney Microbiological Services LTD.","2020-03-19",272,"USA","1110 S. Huron Road","Green Bay",54311,"1,2,3,4",2]
["Cherney Microbiological Services LTD.","2020-03-19",272,"USA","1110 S. Huron Road","Green Bay",54311,"1,2,3,4",3]
["Conagra Brands","2020-05-05T16:25:38","7-COV","USA","104 River Road","Menomonie",54751,3,1]
["Conagra Brands","2020-05-05T16:25:38","7-COV","USA","104 River Road","Menomonie",54751,3,2]
["Dairy Farmers of America, Inc. Colorado","2020-02-04",219,"USA"," 2301 E Bijou Ave","Fort Morgan",80701,2,1]
["Dairy Farmers of America, Inc. Colorado","2020-02-04",219,"USA"," 2301 E Bijou Ave","Fort Morgan",80701,2,2]
["Dairy Farmers of America, Inc. Colorado","2020-02-04",219,"USA"," 2301 E Bijou Ave","Fort Morgan",80701,2,3]
["Dairy Farmers of America, Inc. Nevada","2020-01-21",202,"USA","1400 New River Pkwy","Fallon",89406,2,1]
["Dairy Farmers of America, Inc. Nevada","2020-01-21",202,"USA","1400 New River Pkwy","Fallon",89406,2,2]
["Dairy Farmers of America, Inc. Nevada","2020-01-21",202,"USA","1400 New River Pkwy","Fallon",89406,2,3]
["Dairy Farmers of America, Inc. New México","2019-12-03",63,"USA","1820 S Industrial Dr, NM 88130 United States","Portales",88130,2,1]
["Dairy Farmers of America, Inc. New México","2019-12-03",63,"USA","1820 S Industrial Dr, NM 88130 United States","Portales",88130,2,2]
["Dairy Farmers of America, Inc. New México","2019-12-03",63,"USA","1820 S Industrial Dr, NM 88130 United States","Portales",88130,2,3]
["Dairy Farmers of America, Inc. Texas","2020-02-14",241,"USA","1015 East Broadway ","Winnsboro",75494,2,1]
["Dairy Farmers of America, Inc. Texas","2020-02-14",241,"USA","1015 East Broadway ","Winnsboro",75494,2,2]
["Dairy Farmers of America, Inc. Texas","2020-02-14",241,"USA","1015 East Broadway ","Winnsboro",75494,2,3]
["DARIGOLD CALDWELL","2019-12-18",144,"USA","520 ALBANY STREET","CALDWELL",83605,3,1]
["DARIGOLD CHEHALIS","2019-12-18",142,"USA","67 SW CHEHALIS","CHEHALIS",98532,3,1]
["DARIGOLD CHEHALIS","2019-12-18",142,"USA","67 SW CHEHALIS","CHEHALIS",98532,3,2]
["DARIGOLD CORPORATE LAB (DCL)","2019-12-10",108,"USA","12600 INTERURBAN AVENUE S, SUITE 120","TUKWILA",98168,4,1]
["DARIGOLD CORPORATE LAB (DCL)","2019-12-10",108,"USA","12600 INTERURBAN AVENUE S, SUITE 120","TUKWILA",98168,4,2]
["DARIGOLD JEROME","2019-12-18",143,"USA","1703 SOUTH BUCHANAN","Jerome",83338,3,1]
["DARIGOLD LYNDEN ","2019-12-18",141,"USA","8424 DEPOT ROAD","LYNDEN",98264,3,1]
["DARIGOLD SUNNYSIDE","2019-12-10",107,"USA","400 ALEXANDER ROAD","SUNNYSIDE",98944,3,1]
["Deibel Laboratories","2020-05-05T15:20:19","6-COV","USA","415 South Grove, Suite 10","Blue Earth",56013,"3,4",1]
["Deibel Laboratories","2020-05-05T15:20:19","6-COV","USA","415 South Grove, Suite 10","Blue Earth",56013,"3,4",2]
["Deseret Dairy Products","2020-02-20",245,"USA","784 West 700 South","Salt Lake City",84104,3,1]
["ESIANLAB SC","2019-11-21",28,"MEX","AV ALEMANIA 1220","Guadalajara",44190,4]
["Eurofins DQCI, LLC","2020-01-10",183,"USA","4842 W Jacquelyn","Fresno",93722,4,1]
["Eurofins DQCI, LLC","2020-01-10",183,"USA","4842 W Jacquelyn","Fresno",93722,4,2]
["Eurofins DQCI, LLC","2020-01-10",183,"USA","4842 W Jacquelyn","Fresno",93722,4,3]
["Eurofins ELS Limited","2020-01-23",211,"NZL","85 Port Road, Seaview, LOWER HUTT","Lower Hutt",5045,3,1]
["Eurofins ELS Limited","2020-01-23",211,"NZL","85 Port Road, Seaview, LOWER HUTT","Lower Hutt",5045,3,2]
["Eurofins ELS Limited","2020-01-23",211,"NZL","85 Port Road, Seaview, LOWER HUTT","Lower Hutt",5045,3,3]
["Eurofins Food Analytics NZ Limited","2020-01-23",207,"NZL","35 O'Rorke Road, Penrose, AUCKLAND","Auckland",1642,3,1]
["Eurofins Food Analytics NZ Limited","2020-01-23",207,"NZL","35 O'Rorke Road, Penrose, AUCKLAND","Auckland",1642,3,2]
["Eurofins Food Analytics NZ Limited","2020-01-23",207,"NZL","35 O'Rorke Road, Penrose, AUCKLAND","Auckland",1642,3,3]
["Fonterra Ltd Clandeboye Laboratory","2020-01-15",186,"NZL","Rolleston Road, RD 26","Temuka",7986,"3,4",1]
["Fonterra Ltd Clandeboye Laboratory","2020-01-15",186,"NZL","Rolleston Road, RD 26","Temuka",7986,"3,4",2]
{"$rows_left_out":84}
{"sheet":"Inicio","index":5,"n_rows":0,"n_cols":0,"rows_kept":0,"cut":false,"hidden":false,"merged":[]}

{"sheet":"Layout","index":6,"n_rows":8,"n_cols":7,"rows_kept":8,"cut":false,"hidden":false,"merged":[[0,6,0,9]]}
[null,null,null,null,"Leche en Polvo",null,"Secretaría de Economía\nDirección General de Facilitación Comercial y Comercio Exterior\nNOM - 222 - SCFI / SAGARPA 2018"]
["Número de Informe","NOM","Tipo de producto","Fracción Arancelaria","Fecha de Expedición","Producto"]
[null,"NOM-222-SCFI/SAGARPA-2018",null,{"$f":"+IF($C$3=\"Leche Descremada\",'Catalogo 2'!$I$2,IF($C$3=\"Leche Entera\",'Catalogo 2'!$I$3,IF($C$3=\"Leche Parcialmente Descremada\",'Catalogo 2'!$I$4,\" \")))","v":" "},null,"Leche En Polvo"]
[{"$f":"IFERROR($A$3,\"\")","v":0},{"$f":"IFERROR($B$3,\"\")","v":"NOM-222-SCFI/SAGARPA-2018"},{"$f":"IFERROR($C$3,\"\")","v":0},{"$f":"IFERROR(VLOOKUP($C$3,'Catalogo 2'!$A$11:$B$83,2,FALSE),\"\")","v":""},{"$f":"IFERROR($E$3,\" \")","v":0},"Leche En Polvo"]
[0,"NOM-222-SCFI/SAGARPA-2018",0,{"$f":"IFERROR(VLOOKUP($C$3,'Catalogo 2'!$A$11:$B$83,2,FALSE),\"\")","v":""},0,"Leche En Polvo"]
[0,"NOM-222-SCFI/SAGARPA-2018",0,{"$f":"IFERROR(VLOOKUP($C$3,'Catalogo 2'!$A$11:$B$83,2,FALSE),\"\")","v":""},0,"Leche En Polvo"]
[0,"NOM-222-SCFI/SAGARPA-2018",0,{"$f":"IFERROR(VLOOKUP($C$3,'Catalogo 2'!$A$11:$B$83,2,FALSE),\"\")","v":""},0,"Leche En Polvo"]
[0,"NOM-222-SCFI/SAGARPA-2018",0,{"$f":"IFERROR(VLOOKUP($C$3,'Catalogo 2'!$A$11:$B$83,2,FALSE),\"\")","v":""},0,"Leche En Polvo"]